{"text_format":"1","workbook":"xlsx","n_sheets":7,"sheets":["INSTRUCTIONS","Special Ed Teachers (FS070)","Related Services Pers. (FS099)","Sp Ed Paraprofessionals (FS112)","Dashboard","Error Messages","Edit Check Details"],"not_rendered":{"charts":0,"images":2,"macros":1,"external_links":0,"defined_names":50,"comments":3,"pivot_tables":0},"unopened":[],"bounds":{"document_bytes":16777216,"sheet_cells":100000,"rows_first":2000,"rows_last":500,"rows_between":2000,"halvings":0,"cell_chars":16384,"cell_head_chars":4096},"cells_cut":0,"cells_raw":0,"read":"whole","date_system":"1900"}

{"sheet":"INSTRUCTIONS","index":0,"n_rows":40,"n_cols":15,"rows_kept":40,"cut":false,"hidden":false,"merged":[[0,14,39,14],[1,1,1,13],[2,1,2,12],[3,4,3,5],[7,2,7,12],[9,2,9,12],[13,2,13,12],[15,2,15,12],[16,2,16,12],[29,1,29,13],[30,1,30,3],[23,1,23,13],[39,0,39,13],[11,2,11,12],[17,2,17,12],[19,2,19,12],[20,2,20,11],[21,1,21,13],[25,1,26,13],[27,1,27,12]]}
[null,null,null,null,null,null,null,null,null,null,null,null,null,null,"End of worksheet"]
[null,"Enhanced Pre-submission Edit Check Tool for IDEA 618 Part B Personnel Data"]
[null,"The Enhanced Pre-submission Edit Check Tool for IDEA 618 Part B Personnel Data is designed to be used by states as they prepare their data for submission via EDFacts. Use this tool to check SEA-level EDFacts files FS070, FS099, and FS112. The tool can identify potential edit check errors or errors in subtotals or totals. \n\nPlease note that data cannot be submitted using this tool. All data must be submitted following the guidelines provided in the "]
[null,"data file specifications at: ",null,null,"The EDFacts Initiative"]
[]
[null,"Please read the following instructions before using this tool:"]
[]
[null,"1.","To select, copy, and paste data from your EDFacts files into the tool:\n\n(a)  Open each of the three SEA-level IDEA personnel EDFacts data files (FS070, FS099, and FS112) in Excel (or similar application). \n\n(b)  Select and copy all rows and columns from each EDFacts data file. \n\n          •   Include the EDFacts data file header row and filler columns. \n          •   Do NOT use the \"Select All\" function in Excel. \n"]
[]
[null,null,"\nNOTE: Prior to copying the EDFacts data into each of the green data file tabs, \"Missing Category\" (MC) will appear in all data cells on the  Dashboard, Error Messages, and Edit Check Details tabs.  The missing categories are counted as triggered edit checks and displayed in the \"Triggered Edit Checks\" box on the Dashboard, Error Messages, and Edit Check Details tabs.\n\n(c)  Paste the selected data to cell A11 in the corresponding green data tab in this tool. "]
{"$rows_left_out":31}
{"sheet":"Special Ed Teachers (FS070)","index":1,"n_rows":42,"n_cols":30,"rows_kept":42,"cut":false,"hidden":false,"merged":[[0,29,1048575,29],[0,0,0,12],[8,14,8,16],[2,9,2,12],[3,9,3,11],[4,9,4,11],[5,9,5,11],[6,9,6,11],[41,0,1048575,12]]}
[{"$f":"\"IDEA Personnel Data for School Year \"&'Special Ed Teachers (FS070)'!E11","v":"IDEA Personnel Data for School Year "},null,null,null,null,null,null,null,null,null,null,null,null,null,null,null,null,null,null,null,null,null,null,null,null,"End of worksheet",null,null,null,"End of worksheet"]
[]
[null,null,null,null,null,null,null,null,null,"Triggered Format Checks",null,null,null,null,null,null,null,null,null,null,null,{"$f":"SUM(V12:V40)","v":9}]
[null,null,null,null,null,null,null,null,null,"Type",null,null,"Total"]
[null,null,null,null,null,null,null,null,null,"Missing Data Elements",null,null,{"$f":"COUNTIF(O12:O70,\"?*\")","v":9}]
[null,null,null,null,null,null,null,null,null,"Duplicate Row Elements",null,null,{"$f":"COUNTIF(P13:P71,\"?*\")","v":0}]
[null,null,null,null,null,null,null,null,null,"Invalid Data Elements",null,null,{"$f":"COUNTIF(Q14:Q72,\"?*\")","v":0}]
[]
["FS070 — Special Education Teachers (FTE)",null,null,null,null,null,null,null,null,null,null,null,null,null,"                     Triggered Format Checks"]
["File Record Number","FIPS State Code","State Agency Number","Filler","Filler","Table Name","Filler","Qualification Status (Teachers)","Filler","Age Group","Total Indicator","Explanation","Teacher FTE",null,"Missing\nData Elements\n(formatted)","Duplicate Row\nElements","Invalid Data\nElements",null,"Missing\nData Element","Current\nListing","Master\nListing","Is Blank",null,{"$f":"COUNTIF(O12:O25,\"*\" & $Y$10 & \"*\")","v":0},"MISSING","Master\nListing\n(output)","Current\nListing\n(output)",null,"Is Missing Data Element"]
{"$rows_left_out":33}
{"sheet":"Related Services Pers. (FS099)","index":2,"n_rows":71,"n_cols":29,"rows_kept":71,"cut":false,"hidden":false,"merged":[[0,28,70,28],[0,0,0,11],[8,13,8,15],[2,8,2,11],[3,8,3,10],[6,8,6,10],[5,8,5,10],[4,8,4,10],[70,0,70,11]]}
[{"$f":"\"IDEA Personnel Data for School Year \"&'Special Ed Teachers (FS070)'!E11","v":"IDEA Personnel Data for School Year "},null,null,null,null,null,null,null,null,null,null,null,null,null,null,null,null,null,null,null,null,null,null,null,null,"End of worksheet",null,null,"End of worksheet"]
[]
[null,null,null,null,null,null,null,null,"Triggered Format Checks",null,null,null,null,null,null,null,null,null,null,null,null,{"$f":"SUM(U12:U70)","v":29}]
[null,null,null,null,null,null,null,null,"Type",null,null,"Total"]
[null,null,null,null,null,null,null,null,"Missing Data Elements",null,null,{"$f":"COUNTIF(N12:N70,\"?*\")","v":29}]
[null,null,null,null,null,null,null,null,"Duplicate Row Elements",null,null,{"$f":"COUNTIF(O13:O71,\"?*\")","v":0}]
[null,null,null,null,null,null,null,null,"Invalid Data Elements",null,null,{"$f":"COUNTIF(P14:P72,\"?*\")","v":0}]
[]
["FS099 — Special Education Related Services Personnel ",null,null,null,null,null,null,null,null,null,null,null,null,"Triggered Format Checks"]
["File Record Number","FIPS State Code","State Agency Number","Filler","Filler","Table Name","Staff Category (Special Education Related Service)","Certification Status","Filler","Total Indicator","Explanation","Staff FTE",null,"Missing\nData Elements\n(formatted)","Duplicate Row\nElements","Invalid Data\nElements",null,"Missing\nData Element","Current\nListing","Master\nListing","Is Blank",null,{"$f":"COUNTIF(N12:N25,\"*\" & $Y$10 & \"*\")","v":0},"MISSING","Master\nListing\n(output)","Current\nListing\n(output)",null,"Is Missing Data Element"]
{"$rows_left_out":62}
{"sheet":"Sp Ed Paraprofessionals (FS112)","index":3,"n_rows":42,"n_cols":30,"rows_kept":42,"cut":false,"hidden":false,"merged":[[0,29,41,29],[0,0,0,12],[8,14,8,16],[2,9,2,12],[3,9,3,11],[4,9,4,11],[5,9,5,11],[6,9,6,11],[41,0,41,12]]}
[{"$f":"\"IDEA Personnel Data for School Year \"&'Special Ed Teachers (FS070)'!E11","v":"IDEA Personnel Data for School Year "},null,null,null,null,null,null,null,null,null,null,null,null,null,null,null,null,null,null,"=IF(LEN(AF13)=0,\"\",IF(ISNA(MATCH(AF13,CurrentListing,0)),AG13,\"\"))",null,null,null,null,null,null,null,null,null,"End of worksheet"]
[]
[null,null,null,null,null,null,null,null,null,"Triggered Format Checks",null,null,null,null,null,null,null,null,null,null,null,{"$f":"SUM(V12:V40)","v":9}]
[null,null,null,null,null,null,null,null,null,"Type",null,null,"Total"]
[null,null,null,null,null,null,null,null,null,"Missing Data Elements",null,null,{"$f":"COUNTIF(O12:O70,\"?*\")","v":9}]
[null,null,null,null,null,null,null,null,null,"Duplicate Row Elements",null,null,{"$f":"COUNTIF(P13:P71,\"?*\")","v":0}]
[null,null,null,null,null,null,null,null,null,"Invalid Data Elements",null,null,{"$f":"COUNTIF(Q14:Q72,\"?*\")","v":0}]
[]
["FS112 — Special Education Paraprofessionals ",null,null,null,null,null,null,null,null,null,null,null,null,null,"                     Triggered Format Checks"]
["File Record Number","FIPS State Code","State Agency Number","Filler","Filler","Table Name","Filler","Age Group","Qualification Status","Filler","Total Indicator","Explanation","Staff FTE",null,"Missing\nData Elements\n(formatted)","Duplicate Row\nElements","Invalid Data\nElements",null,"Missing\nData Element","Current\nListing","Master\nListing","Is Blank",null,{"$f":"COUNTIF(O12:O25,\"*\" & $Y$10 & \"*\")","v":0},"MISSING","Master\nListing\n(output)","Current\nListing\n(output)",null,"Is Missing Data Element"]
{"$rows_left_out":33}
{"sheet":"Dashboard","index":4,"n_rows":42,"n_cols":14,"rows_kept":42,"cut":false,"hidden":false,"merged":[[5,3,5,5],[4,3,4,5],[9,0,9,6],[17,0,17,6],[25,0,25,6],[41,0,41,6],[6,3,6,5],[25,13,25,22],[26,13,26,22],[27,13,27,22],[10,13,10,22],[11,13,11,22],[17,13,17,22],[22,13,22,22],[18,13,18,22],[19,13,19,22],[20,13,20,22],[21,13,21,22],[37,1,37,5],[32,1,32,5],[33,1,33,5],[30,1,30,5],[31,1,31,5],[28,1,28,5],[29,1,29,5],[27,1,27,5],[0,0,0,6],[0,7,37,7],[13,13,13,22],[9,13,9,22],[36,13,36,22],[29,13,29,22],[30,13,30,22],[31,13,31,22],[32,13,32,22],[33,13,33,22],[23,13,23,22],[15,13,15,22],[36,1,36,5],[19,1,19,5],[20,1,20,5],[21,1,21,5],[2,3,2,6],[3,3,3,5],[28,13,28,22],[34,13,34,22],[35,13,35,22],[13,1,13,5],[14,1,14,5],[15,1,15,5],[11,1,11,5],[12,1,12,5],[35,1,35,5],[14,13,14,22],[12,13,12,22],[22,1,22,5],[34,1,34,5],[23,1,23,5]]}
[{"$f":"\"IDEA Personnel Data for School Year \"&'Special Ed Teachers (FS070)'!E11","v":"IDEA Personnel Data for School Year "},null,null,null,null,null,null,"End of worksheet"]
[]
[null,null,null," Triggered Edit Checks"]
[null,null,null,"Data File",null,null,"Count"]
[null,null,null,"FS070 — Special Education Teachers (FTE)",null,null,{"$f":"SUM(J11:J16)","v":6}]
[null,null,null,"FS112 — Special Education Paraprofessionals ",null,null,{"$f":"SUM(J19:J24)","v":6}]
[null,null,null,"FS099 — Special Education Related Services Personnel ",null,null,{"$f":"SUM(J27:J37)","v":11}]
[null,null,null,"Total",null,null,{"$f":"SUM(G5:G7)","v":23},null,null,"Search Value:",1]
[]
["FS070 — Special Education Teachers (FTE)",null,null,null,null,null,null,null,"Link","Triggered?","FTE","File",null,"Error Messages"]
{"$rows_left_out":33}
{"sheet":"Error Messages","index":5,"n_rows":45,"n_cols":23,"rows_kept":45,"cut":false,"hidden":false,"merged":[[0,13,42,13],[20,1,20,11],[21,1,21,11],[22,1,22,11],[23,1,23,11],[24,1,24,11],[25,1,25,11],[26,1,26,11],[27,1,27,11],[28,1,28,11],[29,1,29,11],[30,1,30,11],[31,1,31,11],[32,1,32,11],[33,1,33,11],[34,1,34,11],[44,0,44,12],[0,0,0,12],[3,5,3,9],[19,1,19,11],[18,1,18,11],[17,1,17,11],[16,1,16,11],[15,1,15,11],[14,1,14,11],[13,1,13,11],[12,1,12,11],[11,1,11,11],[10,1,10,11],[4,5,4,8]]}
[{"$f":"\"IDEA Personnel Data for School Year \"&'Special Ed Teachers (FS070)'!E11","v":"IDEA Personnel Data for School Year "},null,null,null,null,null,null,null,null,null,null,null,null,"End of worksheet","End of worksheet"]
[null,null,null,null,null,null,null,null,null,null,null,null,null,null,null,null,null,null,null,{"$f":"IFERROR(INDEX(Dashboard!#REF!, SMALL(IF($C$2=Dashboard!J19:J23, ROW(Dashboard!J19:J23)-MIN(ROW(Dashboard!J19:J23))+1, \"\"), ROW(A1))),\"\")","v":""}]
[]
[null,null,null,null,null,"Triggered Edit Checks"]
[null,null,null,null,null,"Data File",null,null,null,"Count",null,null,null,null,null,null,null,null,null,"=IFERROR(INDEX(Dashboard!$T$16:$T$20, SMALL(IF($U$7=Dashboard!$S$16:$S$20, ROW(Dashboard!$S$16:$S$20)-MIN(ROW(Dashboard!$S$16:$S$20))+1, \"\"), ROW(A1))),\"\")"]
[null,null,null,null,null,"FS070 — Special Education Teachers (FTE)",null,null,null,{"$f":"SUM(Dashboard!J11:J16)","v":6}]
[null,null,null,null,null,"FS112 — Special Education Paraprofessionals ",null,null,null,{"$f":"SUM(Dashboard!J19:J24)","v":6}]
[null,null,null,null,null,"FS099 — Special Education Related Services Personnel ",null,null,null,{"$f":"SUM(Dashboard!J27:J37)","v":11},null,null,null,null,null,null,null,null,null,null,1]
[null,null,null,null,null,"Total",null,null,null,{"$f":"SUM(J6:J8)","v":23},null,null,null,null,null,null,null,null,{"$f":"IFERROR(INDEX(Dashboard!$I$11:$I$37, SMALL(IF($U$8=Dashboard!$J$11:$J$37, ROW(Dashboard!$J$11:$J$37)-MIN(ROW(Dashboard!$J$11:$J$37))+1, \"\"), ROW(A1))),\"\")","v":"D12"},{"$f":"IFERROR(INDEX(Dashboard!$N$11:$N$37, SMALL(IF($U$8=Dashboard!$J$11:$J$37, ROW(Dashboard!$J$11:$J$37)-MIN(ROW(Dashboard!$J$11:$J$37))+1, \"\"), ROW(A1))),\"\")","v":"Fully Certified + Not Fully Certified Special Education Teachers for Ages 3-5  ≠ Special Education Teachers for Ages 3-5"},{"$f":"IFERROR(INDEX(Dashboard!$K$11:$K$37, SMALL(IF($U$8=Dashboard!$J$11:$J$37, ROW(Dashboard!$J$11:$J$37)-MIN(ROW(Dashboard!$J$11:$J$37))+1, \"\"), ROW(A1))),\"\")","v":"MC"},{"$f":"IFERROR(INDEX(Dashboard!$L$11:$L$37, SMALL(IF($U$8=Dashboard!$J$11:$J$37, ROW(Dashboard!$J$11:$J$37)-MIN(ROW(Dashboard!$J$11:$J$37))+1, \"\"), ROW(A1))),\"\")","v":"FS070"},{"$f":"IF(U9=\"No Data\",1,0)","v":0}]
[null,null,null,null,null,null,null,null,null,null,null,null,null,null,null,null,null,null,{"$f":"IFERROR(INDEX(Dashboard!$I$11:$I$37, SMALL(IF($U$8=Dashboard!$J$11:$J$37, ROW(Dashboard!$J$11:$J$37)-MIN(ROW(Dashboard!$J$11:$J$37))+1, \"\"), ROW(A2))),\"\")","v":"D13"},{"$f":"IFERROR(INDEX(Dashboard!$N$11:$N$37, SMALL(IF($U$8=Dashboard!$J$11:$J$37, ROW(Dashboard!$J$11:$J$37)-MIN(ROW(Dashboard!$J$11:$J$37))+1, \"\"), ROW(A2))),\"\")","v":"Fully Certified + Not Fully Certified Special Education Teachers for Ages 6-21  ≠ Special Education Teachers for Ages 6-21"},{"$f":"IFERROR(INDEX(Dashboard!$K$11:$K$37, SMALL(IF($U$8=Dashboard!$J$11:$J$37, ROW(Dashboard!$J$11:$J$37)-MIN(ROW(Dashboard!$J$11:$J$37))+1, \"\"), ROW(A2))),\"\")","v":"MC"},{"$f":"IFERROR(INDEX(Dashboard!$L$11:$L$37, SMALL(IF($U$8=Dashboard!$J$11:$J$37, ROW(Dashboard!$J$11:$J$37)-MIN(ROW(Dashboard!$J$11:$J$37))+1, \"\"), ROW(A2))),\"\")","v":"FS070"},0]
{"$rows_left_out":36}
{"sheet":"Edit Check Details","index":6,"n_rows":52,"n_cols":15,"rows_kept":52,"cut":false,"hidden":false,"merged":[[0,0,0,3],[0,4,37,4],[18,9,18,12],[24,9,24,12],[37,0,37,3],[9,0,9,3],[15,0,15,3],[21,0,21,3],[7,1,7,2],[6,1,6,2],[5,1,5,2],[4,1,4,2],[3,1,3,2],[2,1,2,3],[12,9,12,12]]}
[{"$f":"\"IDEA Personnel Data for School Year \"&'Special Ed Teachers (FS070)'!E11","v":"IDEA Personnel Data for School Year "},null,null,null,"End of worksheet"]
[]
[null,"Triggered Edit Checks"]
[null,"Data File",null,"Count"]
[null,"FS070 — Special Education Teachers (FTE)",null,{"$f":"SUM(Dashboard!J11:J16)","v":6}]
[null,"FS112 — Special Education Paraprofessionals ",null,{"$f":"SUM(Dashboard!J19:J24)","v":6}]
[null,"FS099 — Special Education Related Services Personnel ",null,{"$f":"SUM(Dashboard!J27:J37)","v":11}]
[null,"Total",null,{"$f":"SUM(D5:D7)","v":23}]
[null,null,null," "]
["FS070 — Special Education Teachers (FTE)"]
{"$rows_left_out":42}